0
I Use This!
Very Low Activity

Commits : Listings

Analyzed about 4 hours ago. based on code collected about 4 hours ago.
Aug 21, 2016 — Aug 21, 2017
Commit Message Contributor Files Modified Lines Added Lines Removed Code Location Date
Change the symbol 'NIL to lower case Anon32 More... 7 months ago
Export DEF-SUITE* Fa1e806f97322661e06279d2f35e7ab8?&s=32&rating=pg&d=http%3a%2f%2fopenhub.net%2fanon32 More... 8 months ago
Reduce expansion size for PROCESS-FAILURE. Anon32 More... 8 months ago
Assume skipped tests are ok in results-status. Anon32 More... 10 months ago
Declare types of *ON-{ERROR,FAILURE}* Anon32 More... 10 months ago
Fix lack of hygiene in expansion of FINISHES Fa1e806f97322661e06279d2f35e7ab8?&s=32&rating=pg&d=http%3a%2f%2fopenhub.net%2fanon32 More... about 1 year ago
Cosmetic change Fa1e806f97322661e06279d2f35e7ab8?&s=32&rating=pg&d=http%3a%2f%2fopenhub.net%2fanon32 More... about 1 year ago
Release 1.3 Fa1e806f97322661e06279d2f35e7ab8?&s=32&rating=pg&d=http%3a%2f%2fopenhub.net%2fanon32 More... over 1 year ago
Cosmetic changes Fa1e806f97322661e06279d2f35e7ab8?&s=32&rating=pg&d=http%3a%2f%2fopenhub.net%2fanon32 More... over 1 year ago
Add *ON-ERROR* and *ON-FAILURE* Fa1e806f97322661e06279d2f35e7ab8?&s=32&rating=pg&d=http%3a%2f%2fopenhub.net%2fanon32 More... over 1 year ago
Add *DEFAULT-TEST-COMPILATION-TIME* Fa1e806f97322661e06279d2f35e7ab8?&s=32&rating=pg&d=http%3a%2f%2fopenhub.net%2fanon32 More... over 1 year ago
New SUMMARY parameter to RUN-ALL-TESTS. Anon32 More... over 1 year ago
Compile tests by default at definition time Fa1e806f97322661e06279d2f35e7ab8?&s=32&rating=pg&d=http%3a%2f%2fopenhub.net%2fanon32 More... over 1 year ago
Implement function RUN-ALL-TESTS Fa1e806f97322661e06279d2f35e7ab8?&s=32&rating=pg&d=http%3a%2f%2fopenhub.net%2fanon32 More... over 1 year ago
Disable stack exhaustion tests for the moment Fa1e806f97322661e06279d2f35e7ab8?&s=32&rating=pg&d=http%3a%2f%2fopenhub.net%2fanon32 More... over 1 year ago
Upgrade ASDF requirement to 3.1 Fa1e806f97322661e06279d2f35e7ab8?&s=32&rating=pg&d=http%3a%2f%2fopenhub.net%2fanon32 More... almost 2 years ago
Switch to sionescu/cl-travis Fa1e806f97322661e06279d2f35e7ab8?&s=32&rating=pg&d=http%3a%2f%2fopenhub.net%2fanon32 More... about 2 years ago
Fix typo Fa1e806f97322661e06279d2f35e7ab8?&s=32&rating=pg&d=http%3a%2f%2fopenhub.net%2fanon32 More... about 2 years ago
Style fixes Fa1e806f97322661e06279d2f35e7ab8?&s=32&rating=pg&d=http%3a%2f%2fopenhub.net%2fanon32 More... about 2 years ago
Add TravisCI config file Fa1e806f97322661e06279d2f35e7ab8?&s=32&rating=pg&d=http%3a%2f%2fopenhub.net%2fanon32 More... about 2 years ago
Use modern ASDF style Fa1e806f97322661e06279d2f35e7ab8?&s=32&rating=pg&d=http%3a%2f%2fopenhub.net%2fanon32 More... about 2 years ago
handle storage-condition Anon32 More... over 2 years ago
add storage-condition error case Anon32 More... over 2 years ago
Indicate test failures with return value. Anon32 More... over 2 years ago
Release 1.2 Fa1e806f97322661e06279d2f35e7ab8?&s=32&rating=pg&d=http%3a%2f%2fopenhub.net%2fanon32 More... almost 4 years ago
Print a backtrace on error or test failure C8cf9bd8e8e6cb1860dc384426f89951?&s=32&rating=pg&d=http%3a%2f%2fopenhub.net%2fanon32 More... about 4 years ago
Don't print newline Fa1e806f97322661e06279d2f35e7ab8?&s=32&rating=pg&d=http%3a%2f%2fopenhub.net%2fanon32 More... about 4 years ago
Test output goes to *TEST-DRIBBLE* Fa1e806f97322661e06279d2f35e7ab8?&s=32&rating=pg&d=http%3a%2f%2fopenhub.net%2fanon32 More... about 4 years ago
Declaim *SUITE* special Fa1e806f97322661e06279d2f35e7ab8?&s=32&rating=pg&d=http%3a%2f%2fopenhub.net%2fanon32 More... about 4 years ago
Fix typo Fa1e806f97322661e06279d2f35e7ab8?&s=32&rating=pg&d=http%3a%2f%2fopenhub.net%2fanon32 More... about 4 years ago